Python Error 215 Empty In Function Detectmultiscale Information Guide

  1. Overview to Python Error 215 Empty In Function Detectmultiscale
  2. Core Information
  3. Recent Updates
  4. Full Guide
  5. Future Outlook

Overview to Python Error 215 Empty In Function Detectmultiscale

PYTHON : error: (-215) !empty() in function detectMultiScale News
Looking for the latest information on Python Error 215 Empty In Function Detectmultiscale? We've researched comprehensive data, records, and insights about Python Error 215 Empty In Function Detectmultiscale.

Core Information

Full PYTHON : error: (-215) !empty() in function detectMultiScale News
Explore the main sources for Python Error 215 Empty In Function Detectmultiscale.

Recent Updates

error: (-215:Assertion failed) !empty() in function 'cv::CascadeClassifier::detectMultiScale Update
Stay updated on Python Error 215 Empty In Function Detectmultiscale's newest achievements.

error: (-215:Assertion failed) !_src.empty() in function 'cv::cvtColor' SOLVED in opencv
error: (-215:Assertion failed) !_src.empty() in function 'cv::cvtColor' SOLVED in opencv
cv2.error: OpenCV(4.5.5) error: (-215:Assertion failed) !_img.empty() in function 'cv::imwrite'
cv2.error: OpenCV(4.5.5) error: (-215:Assertion failed) !_img.empty() in function 'cv::imwrite'
(SOLVED) Error Assertion failed ! src empty in Function  cv: cvtColor | Python error | cv2 Module
(SOLVED) Error Assertion failed ! src empty in Function cv: cvtColor | Python error | cv2 Module
cv2.error: error: (-215:Assertion failed) !_src.empty() in function 'cv::cvtColor'
cv2.error: error: (-215:Assertion failed) !_src.empty() in function 'cv::cvtColor'
PYTHON : OpenCV Error: (-215)size.width 0 && size.height 0 in function imshow
PYTHON : OpenCV Error: (-215)size.width 0 && size.height 0 in function imshow
error: (-215:Assertion failed) src.type() == CV_8UC1 in function 'cv::adaptiveThreshold'
error: (-215:Assertion failed) src.type() == CV_8UC1 in function 'cv::adaptiveThreshold'
error: (-215:Assertion failed) !ssize.empty() in function 'cv::resize' | cv2.error
error: (-215:Assertion failed) !ssize.empty() in function 'cv::resize' | cv2.error
PYTHON : OpenCV resize fails on large image with error: (-215) ssize.area()   0 in function cv::res
PYTHON : OpenCV resize fails on large image with error: (-215) ssize.area() 0 in function cv::res
Face Detection using Python | Module 'cv2' has no 'CascadeClassifier' member | Error solved
Face Detection using Python | Module 'cv2' has no 'CascadeClassifier' member | Error solved
Face detection using OpenCV
Face detection using OpenCV
PYTHON : Parameters of detectMultiScale in OpenCV using Python
PYTHON : Parameters of detectMultiScale in OpenCV using Python

Full Guide

Data is compiled from public records and verified media reports.

Last Updated: September 26, 2026

Future Outlook

Information (Solution)cv2.error: error: (-215:Assertion failed) !_src.empty() in function 'cv::cvtColor' News
For 2026, Python Error 215 Empty In Function Detectmultiscale remains one of the most talked-about information profiles. Check back for the newest reports.

Disclaimer: Disclaimer: All information is compiled from publicly available data, media reports, and analysis. Actual details may vary.

Summary

I am fresher youtuber Sorry for my mistakes. If you have any query here, I will reply you. Thank you. error215Assertionfailedssizeemptyinfunctioncvresize GitHub: github.com/shabin75/Face-detection-openCV code: import cv2 import matplotlib.pyplot as plt test_image ...

Python Error 215 Empty In Function Detectmultiscale.pdf

Size: 2.45 MB · Format: PDF · Secure Download

Download PDF Read Online

Frequently Asked Questions

What is the most accurate information about Python Error 215 Empty In Function Detectmultiscale?

Our platform aggregates the most comprehensive and up-to-date insights, ensuring you get relevant details about Python Error 215 Empty In Function Detectmultiscale.

Why is Python Error 215 Empty In Function Detectmultiscale trending right now?

Interest in Python Error 215 Empty In Function Detectmultiscale has surged recently as more people seek reliable resources, related media, and detailed analysis.

Where can I find related media and updates for Python Error 215 Empty In Function Detectmultiscale?

You can explore extensive galleries, video summaries, and related content directly on this page.

How often is the content about Python Error 215 Empty In Function Detectmultiscale updated?

We regularly update our database with the latest information, media, and analysis related to Python Error 215 Empty In Function Detectmultiscale.

Related Documents

Popular Topics

The Ultimate Astrology Love Compatibility Chart Hack You Need From Anniversaries To First Birthdays Find The Perfect Gift With Us How To Create A Simple Web Page Using Html5 Tutorial Pointers Arithmetic And Comparison C Programming Tutorial In Nepali 51 Outlining Strategies And Techniques Week 1 Live Java Fields Primitives Operations And Casting Project Planning And Tracking Progress In Linear How To Execute Sql Script In Sql Server Management Studio Templates Continious Probability Distribution Triangular Distribution Example Switch Statement In Php Php Tutorial Making Frames Part 1 Create Interactive Tabs With Html Css Javascript Smooth Ui Design Meshcentral Technical Meshcore Meshcmd How To Build A Mad Lib C Tutorial