Python Opencv Error 215 Size Width 0 Size Height 0 In Function Imshow Information Guide

  1. Introduction on Python Opencv Error 215 Size Width 0 Size Height 0 In Function Imshow
  2. Key Details
  3. Developments
  4. Deep Dive
  5. Conclusion

Introduction on Python Opencv Error 215 Size Width 0 Size Height 0 In Function Imshow

Details PYTHON : OpenCV Error: (-215)size.width 0 && size.height 0 in function imshow Guide
Looking for the latest information on Python Opencv Error 215 Size Width 0 Size Height 0 In Function Imshow? We've compiled comprehensive data, records, and insights about Python Opencv Error 215 Size Width 0 Size Height 0 In Function Imshow.

Key Details

error:(-215:Assertion failed) size.width0 && size.height0 in function 'cv::imshow' SOLVED in opencv News
Explore the primary sources for Python Opencv Error 215 Size Width 0 Size Height 0 In Function Imshow.

Developments

Full 100% resolved imshow | (-215: Assertion Failed) size.width && size.height in function 'cv::imshow' Guide
Stay updated on Python Opencv Error 215 Size Width 0 Size Height 0 In Function Imshow's latest milestones.

error: (-215:Assertion failed) size.width>0 && size.height>0 in function 'cv::imshow' |cv2.error
error: (-215:Assertion failed) size.width>0 && size.height>0 in function 'cv::imshow' |cv2.error
C++ : OpenCV Error: Assertion failed (size.width 0 && size.height 0) simple code
C++ : OpenCV Error: Assertion failed (size.width 0 && size.height 0) simple code
error: (-215:Assertion failed) size.width>0 && size.height>0 in function 'cv::imshow' |cv2.error
error: (-215:Assertion failed) size.width>0 && size.height>0 in function 'cv::imshow' |cv2.error
PYTHON : error: (-215) !empty() in function detectMultiScale
PYTHON : error: (-215) !empty() in function detectMultiScale
error: (-215:Assertion failed) !_src.empty() in function 'cv::cvtColor' SOLVED in opencv
error: (-215:Assertion failed) !_src.empty() in function 'cv::cvtColor' SOLVED in opencv
OpenCV python get error when use imshow
OpenCV python get error when use imshow
cv2.error: OpenCV(4.5.5) error: (-215:Assertion failed) !_img.empty() in function 'cv::imwrite'
cv2.error: OpenCV(4.5.5) error: (-215:Assertion failed) !_img.empty() in function 'cv::imwrite'
error: (-215:Assertion failed) src.type() == CV_8UC1 in function 'cv::adaptiveThreshold'
error: (-215:Assertion failed) src.type() == CV_8UC1 in function 'cv::adaptiveThreshold'
Python Opencv imshow error
Python Opencv imshow error
cv2.error: error: (-215:Assertion failed) !_src.empty() in function 'cv::cvtColor'
cv2.error: error: (-215:Assertion failed) !_src.empty() in function 'cv::cvtColor'
PYTHON : cv2.imshow command doesn't work properly in opencv-python
PYTHON : cv2.imshow command doesn't work properly in opencv-python

Deep Dive

Data is compiled from public records and verified media reports.

Last Updated: September 27, 2026

Conclusion

PYTHON : OpenCV resize fails on large image with error: (-215) ssize.area()   0 in function cv::res Guide
For 2026, Python Opencv Error 215 Size Width 0 Size Height 0 In Function Imshow remains one of the most talked-about information profiles. Check back for the latest updates.

Disclaimer: Disclaimer: All information is compiled from publicly available data, media reports, and analysis. Actual details may vary.

Summary

error215Assertionfailedsizewidthgt0sizeheightgt0infunctioncvimshow # Download this code from codegive.com Title: Troubleshooting

Python Opencv Error 215 Size Width 0 Size Height 0 In Function Imshow.pdf

Size: 3.84 MB · Format: PDF · Secure Download

Download PDF Read Online

Frequently Asked Questions

What is the most accurate information about Python Opencv Error 215 Size Width 0 Size Height 0 In Function Imshow?

Our platform aggregates the most comprehensive and up-to-date insights, ensuring you get relevant details about Python Opencv Error 215 Size Width 0 Size Height 0 In Function Imshow.

Why is Python Opencv Error 215 Size Width 0 Size Height 0 In Function Imshow trending right now?

Interest in Python Opencv Error 215 Size Width 0 Size Height 0 In Function Imshow has surged recently as more people seek reliable resources, related media, and detailed analysis.

Where can I find related media and updates for Python Opencv Error 215 Size Width 0 Size Height 0 In Function Imshow?

You can explore extensive galleries, video summaries, and related content directly on this page.

How often is the content about Python Opencv Error 215 Size Width 0 Size Height 0 In Function Imshow updated?

We regularly update our database with the latest information, media, and analysis related to Python Opencv Error 215 Size Width 0 Size Height 0 In Function Imshow.

Related Documents

Popular Topics

Multiple Typing Text Animation Using Html Css Javascript Array In Java With Practice Short Questions Python Tutorial For Beginners Part 13 Sequences Can Aspiring Programmers Build Real World Apps With Just Javascript Javascript Toolkit News How To Make A Mad Libs %f0%9f%a4%94python Try Except Error Handling Tamil Python Pythonintamil Errorhandlingexceptionhandling Uncover Hidden Nail Template Secrets For The Perfect Nail Finish I Am Changing My Tech Stack In 2025 Python Matplotlib Image Display Why Your Eagles Lineup Falls Short A Depth Chart Diagnostic Tool Numerical Differentiation With Python Part 2 Webflow Seo Setup Tutorial Rank Your Website Students Respond To Princeton Academic Calendar Encryption Program In Python Extract Rgb Colors From An Image Using Opencv Python Image Processing