Error 215 Assertion Failed Ssize Empty In Function Cv Resize Cv2 Error Information Guide

  1. Introduction to Error 215 Assertion Failed Ssize Empty In Function Cv Resize Cv2 Error
  2. Core Information
  3. Developments
  4. Detailed Analysis
  5. Conclusion

Introduction to Error 215 Assertion Failed Ssize Empty In Function Cv Resize Cv2 Error

error: (-215:Assertion failed) !ssize.empty() in function 'cv::resize' | cv2.error Update
Looking for the latest information on Error 215 Assertion Failed Ssize Empty In Function Cv Resize Cv2 Error? We've researched comprehensive data, records, and insights about Error 215 Assertion Failed Ssize Empty In Function Cv Resize Cv2 Error.

Core Information

Information (Solution)cv2.error: error: (-215:Assertion failed) !_src.empty() in function 'cv::cvtColor' Guide
Explore the main sources for Error 215 Assertion Failed Ssize Empty In Function Cv Resize Cv2 Error.

Developments

Full PYTHON : OpenCV resize fails on large image with error: (-215) ssize.area()   0 in function cv::res Update
Stay updated on Error 215 Assertion Failed Ssize Empty In Function Cv Resize Cv2 Error's newest achievements.

error: (-215:Assertion failed) !_src.empty() in function 'cv::cvtColor' SOLVED in opencv
error: (-215:Assertion failed) !_src.empty() in function 'cv::cvtColor' SOLVED in opencv
PYTHON : error: (-215) !empty() in function detectMultiScale
PYTHON : error: (-215) !empty() in function detectMultiScale
PYTHON : error: (-215) !empty() in function detectMultiScale
PYTHON : error: (-215) !empty() in function detectMultiScale
cv2.error: error: (-215:Assertion failed) !_src.empty() in function 'cv::cvtColor'
cv2.error: error: (-215:Assertion failed) !_src.empty() in function 'cv::cvtColor'
error:(-215:Assertion failed) size.width0 && size.height0 in function 'cv::imshow' SOLVED in opencv
error:(-215:Assertion failed) size.width0 && size.height0 in function 'cv::imshow' SOLVED in opencv
error: (-215:Assertion failed) size.width>0 && size.height>0 in function 'cv::imshow' |cv2.error
error: (-215:Assertion failed) size.width>0 && size.height>0 in function 'cv::imshow' |cv2.error
error: (-215:Assertion failed) size.width>0 && size.height>0 in function 'cv::imshow' |cv2.error
error: (-215:Assertion failed) size.width>0 && size.height>0 in function 'cv::imshow' |cv2.error
(SOLVED) Error Assertion failed ! src empty in Function  cv: cvtColor | Python error | cv2 Module
(SOLVED) Error Assertion failed ! src empty in Function cv: cvtColor | Python error | cv2 Module
error: (-215:Assertion failed) !empty() in function 'cv::CascadeClassifier::detectMultiScale
error: (-215:Assertion failed) !empty() in function 'cv::CascadeClassifier::detectMultiScale
100% resolved imshow | (-215: Assertion Failed) size.width && size.height in function 'cv::imshow'
100% resolved imshow | (-215: Assertion Failed) size.width && size.height in function 'cv::imshow'
error: (-215:Assertion failed) src.type() == CV_8UC1 in function 'cv::adaptiveThreshold'
error: (-215:Assertion failed) src.type() == CV_8UC1 in function 'cv::adaptiveThreshold'

Detailed Analysis

Data is compiled from public records and verified media reports.

Last Updated: September 26, 2026

Conclusion

Information cv2.error: OpenCV(4.5.5) error: (-215:Assertion failed) !_img.empty() in function 'cv::imwrite' Update
For 2026, Error 215 Assertion Failed Ssize Empty In Function Cv Resize Cv2 Error remains one of the most searched-for information profiles. Check back for the newest reports.

Disclaimer: Disclaimer: All information is compiled from publicly available data, media reports, and analysis. Actual details may vary.

Summary

error215Assertionfailedssizeemptyinfunctioncvresize I am fresher youtuber Sorry for my mistakes. If you have any query here, I will reply you. Thank you.

Error 215 Assertion Failed Ssize Empty In Function Cv Resize Cv2 Error.pdf

Size: 3.23 MB · Format: PDF · Secure Download

Download PDF Read Online

Frequently Asked Questions

What is the most accurate information about Error 215 Assertion Failed Ssize Empty In Function Cv Resize Cv2 Error?

Our platform aggregates the most comprehensive and up-to-date insights, ensuring you get relevant details about Error 215 Assertion Failed Ssize Empty In Function Cv Resize Cv2 Error.

Why is Error 215 Assertion Failed Ssize Empty In Function Cv Resize Cv2 Error trending right now?

Interest in Error 215 Assertion Failed Ssize Empty In Function Cv Resize Cv2 Error has surged recently as more people seek reliable resources, related media, and detailed analysis.

Where can I find related media and updates for Error 215 Assertion Failed Ssize Empty In Function Cv Resize Cv2 Error?

You can explore extensive galleries, video summaries, and related content directly on this page.

How often is the content about Error 215 Assertion Failed Ssize Empty In Function Cv Resize Cv2 Error updated?

We regularly update our database with the latest information, media, and analysis related to Error 215 Assertion Failed Ssize Empty In Function Cv Resize Cv2 Error.

Related Documents

Popular Topics

Don T Use Forwardref In React Js How To Create Excel Functions With Lambda Different Note Taking Methods Transparent Glass Effect Login Form In Html Css Html And Css Requesting From Elsewhere Create A Free Natal Chart On Astro Com With Different House Systems Unit 5 Lesson 5 Encapsulation Python Tutorials Python For Data Science Telugu The Secrets To Rowing Olympic Insider Dmvstop 30 Day Temporary Plate And Registration Bivariate Visualizations Part 3b Using Flexplot And R For Visualizing Bivariate Data Amazon Scam Warning Beware Of Deliveries You Didn T Order Ggplot2 Part 2 Exploratory Data Analysis Ed 319 Seh Based Stack Overflow Exploit How To Access Html Elements Using Javascript Learn Getelementbyid Queryselector Dom Basics