Introduction on Cv2 Error Error 215 Assertion Failed Src Empty In Function Cv Cvtcolor
Looking for the latest information on Cv2 Error Error 215 Assertion Failed Src Empty In Function Cv Cvtcolor? We've compiled comprehensive data, records, and insights about Cv2 Error Error 215 Assertion Failed Src Empty In Function Cv Cvtcolor.
Core Information
Explore the primary sources for Cv2 Error Error 215 Assertion Failed Src Empty In Function Cv Cvtcolor.
Recent Updates
Stay updated on Cv2 Error Error 215 Assertion Failed Src Empty In Function Cv Cvtcolor's newest achievements.
Video Capture function produces cv::cvtcolor error | OpenCv error resolved
cv2.error: OpenCV(4.5.5) error: (-215:Assertion failed) !_img.empty() in function 'cv::imwrite'
error: (-215:Assertion failed) !ssize.empty() in function 'cv::resize' | cv2.error
PYTHON : imread returns None, violating assertion !_src.empty() in function 'cvtColor' error
PYTHON : error: (-215) !empty() in function detectMultiScale
PYTHON : imread returns None, violating assertion !_src.empty() in function 'cvtColor' error
error: (-215:Assertion failed) src.type() == CV_8UC1 in function 'cv::adaptiveThreshold'
error: (-215:Assertion failed) !empty() in function 'cv::CascadeClassifier::detectMultiScale
cv2.error: OpenCV(4.5.2) :-1: error: (-5:Bad argument) in function 'cvtColor'
error:(-215:Assertion failed) size.width0 && size.height0 in function 'cv::imshow' SOLVED in opencv
PYTHON : error: (-215) !empty() in function detectMultiScale
Detailed Analysis
Data is compiled from public records and verified media reports.
Last Updated: September 27, 2026
Summary
For 2026, Cv2 Error Error 215 Assertion Failed Src Empty In Function Cv Cvtcolor remains one of the most talked-about information profiles. Check back for the newest reports.
Disclaimer: Disclaimer: All information is compiled from publicly available data, media reports, and analysis. Actual details may vary.
Summary
I am fresher youtuber Sorry for my mistakes. If you have any query here, I will reply you. Thank you. error215Assertionfailedssizeemptyinfunctioncvresize PYTHON : imread returns None, violating cv2errorOpenCV4521error5BadargumentinfunctioncvtColor
Cv2 Error Error 215 Assertion Failed Src Empty In Function Cv Cvtcolor.pdf
What is the most accurate information about Cv2 Error Error 215 Assertion Failed Src Empty In Function Cv Cvtcolor?
Our platform aggregates the most comprehensive and up-to-date insights, ensuring you get relevant details about Cv2 Error Error 215 Assertion Failed Src Empty In Function Cv Cvtcolor.
Why is Cv2 Error Error 215 Assertion Failed Src Empty In Function Cv Cvtcolor trending right now?
Interest in Cv2 Error Error 215 Assertion Failed Src Empty In Function Cv Cvtcolor has surged recently as more people seek reliable resources, related media, and detailed analysis.
Where can I find related media and updates for Cv2 Error Error 215 Assertion Failed Src Empty In Function Cv Cvtcolor?
You can explore extensive galleries, video summaries, and related content directly on this page.
How often is the content about Cv2 Error Error 215 Assertion Failed Src Empty In Function Cv Cvtcolor updated?
We regularly update our database with the latest information, media, and analysis related to Cv2 Error Error 215 Assertion Failed Src Empty In Function Cv Cvtcolor.