Python Error 215 Empty In Function Detectmultiscale Information Guide

  1. Overview to Python Error 215 Empty In Function Detectmultiscale
  2. Core Information
  3. Recent Updates
  4. Full Guide
  5. Future Outlook

Overview to Python Error 215 Empty In Function Detectmultiscale

PYTHON : error: (-215) !empty() in function detectMultiScale News
Looking for the latest information on Python Error 215 Empty In Function Detectmultiscale? We've researched comprehensive data, records, and insights about Python Error 215 Empty In Function Detectmultiscale.

Core Information

Full PYTHON : error: (-215) !empty() in function detectMultiScale News
Explore the main sources for Python Error 215 Empty In Function Detectmultiscale.

Recent Updates

error: (-215:Assertion failed) !empty() in function 'cv::CascadeClassifier::detectMultiScale Update
Stay updated on Python Error 215 Empty In Function Detectmultiscale's newest achievements.

error: (-215:Assertion failed) !_src.empty() in function 'cv::cvtColor' SOLVED in opencv
error: (-215:Assertion failed) !_src.empty() in function 'cv::cvtColor' SOLVED in opencv
cv2.error: error: (-215:Assertion failed) !_src.empty() in function 'cv::cvtColor'
cv2.error: error: (-215:Assertion failed) !_src.empty() in function 'cv::cvtColor'
(SOLVED) Error Assertion failed ! src empty in Function  cv: cvtColor | Python error | cv2 Module
(SOLVED) Error Assertion failed ! src empty in Function cv: cvtColor | Python error | cv2 Module
PYTHON : OpenCV Error: (-215)size.width 0 && size.height 0 in function imshow
PYTHON : OpenCV Error: (-215)size.width 0 && size.height 0 in function imshow
cv2.error: OpenCV(4.5.5) error: (-215:Assertion failed) !_img.empty() in function 'cv::imwrite'
cv2.error: OpenCV(4.5.5) error: (-215:Assertion failed) !_img.empty() in function 'cv::imwrite'
error: (-215:Assertion failed) src.type() == CV_8UC1 in function 'cv::adaptiveThreshold'
error: (-215:Assertion failed) src.type() == CV_8UC1 in function 'cv::adaptiveThreshold'
error: (-215:Assertion failed) !ssize.empty() in function 'cv::resize' | cv2.error
error: (-215:Assertion failed) !ssize.empty() in function 'cv::resize' | cv2.error
PYTHON : imread returns None, violating assertion !_src.empty() in function 'cvtColor' error
PYTHON : imread returns None, violating assertion !_src.empty() in function 'cvtColor' error
PYTHON : OpenCV resize fails on large image with error: (-215) ssize.area()   0 in function cv::res
PYTHON : OpenCV resize fails on large image with error: (-215) ssize.area() 0 in function cv::res
Face Detection using Python | Module 'cv2' has no 'CascadeClassifier' member | Error solved
Face Detection using Python | Module 'cv2' has no 'CascadeClassifier' member | Error solved
Face detection using OpenCV
Face detection using OpenCV

Full Guide

Data is compiled from public records and verified media reports.

Last Updated: September 25, 2026

Future Outlook

Information (Solution)cv2.error: error: (-215:Assertion failed) !_src.empty() in function 'cv::cvtColor' News
For 2026, Python Error 215 Empty In Function Detectmultiscale remains one of the most talked-about information profiles. Check back for the newest reports.

Disclaimer: Disclaimer: All information is compiled from publicly available data, media reports, and analysis. Actual details may vary.

Summary

I am fresher youtuber Sorry for my mistakes. If you have any query here, I will reply you. Thank you. error215Assertionfailedssizeemptyinfunctioncvresize GitHub: github.com/shabin75/Face-detection-openCV code: import cv2 import matplotlib.pyplot as plt test_image ...

Python Error 215 Empty In Function Detectmultiscale.pdf

Size: 2.45 MB · Format: PDF · Secure Download

Download PDF Read Online

Frequently Asked Questions

What is the most accurate information about Python Error 215 Empty In Function Detectmultiscale?

Our platform aggregates the most comprehensive and up-to-date insights, ensuring you get relevant details about Python Error 215 Empty In Function Detectmultiscale.

Why is Python Error 215 Empty In Function Detectmultiscale trending right now?

Interest in Python Error 215 Empty In Function Detectmultiscale has surged recently as more people seek reliable resources, related media, and detailed analysis.

Where can I find related media and updates for Python Error 215 Empty In Function Detectmultiscale?

You can explore extensive galleries, video summaries, and related content directly on this page.

How often is the content about Python Error 215 Empty In Function Detectmultiscale updated?

We regularly update our database with the latest information, media, and analysis related to Python Error 215 Empty In Function Detectmultiscale.

Related Documents

Popular Topics

Mastering UC Davis MyChart Login For Stress-Free Health Management Discover Hidden Gems In Michigan State's Master Course Schedule Get Inside The Mind Of Ocean's Chord Master With Insider Secrets Unlock Mosaic Art With Free Templates Colorado Income Tax Returns - A Beginner's Comprehensive Overview Western Washington Academic Calendar: What Students Wish They Knew What Does Your Dora License Number Actually Mean? Create Your Own All About Me In Spanish Printable Worksheet Easily AP Biology Study Tricks: How To Memorize Complex Formulas Like A Pro Get Ready To Score Big With Expert Basketball Drawing Tips Unlock Your Florida Flair Account In Minutes Insider Secret: Master Your Santa Ana Unified Academic Calendar The Surprising Truth About Free Printable Mad Libs For Teachers. Avoid These Common Mistakes When Planning Your Stonehill Schedule Master NDSU Academic Calendar 25 26 Planning