Error 215 Assertion Failed Empty In Function Cv Cascadeclassifier Detectmultiscale Information Guide

  1. Overview on Error 215 Assertion Failed Empty In Function Cv Cascadeclassifier Detectmultiscale
  2. Important Facts
  3. Recent Updates
  4. Expert Insights
  5. Future Outlook

Overview on Error 215 Assertion Failed Empty In Function Cv Cascadeclassifier Detectmultiscale

Information error: (-215:Assertion failed) !empty() in function 'cv::CascadeClassifier::detectMultiScale Guide
Looking for the latest information on Error 215 Assertion Failed Empty In Function Cv Cascadeclassifier Detectmultiscale? We've compiled comprehensive data, records, and insights about Error 215 Assertion Failed Empty In Function Cv Cascadeclassifier Detectmultiscale.

Important Facts

Information error: (-215:Assertion failed) !_src.empty() in function 'cv::cvtColor' SOLVED in opencv News
Explore the main sources for Error 215 Assertion Failed Empty In Function Cv Cascadeclassifier Detectmultiscale.

Recent Updates

Details PYTHON : error: (-215) !empty() in function detectMultiScale Update
Stay updated on Error 215 Assertion Failed Empty In Function Cv Cascadeclassifier Detectmultiscale's newest achievements.

cv2.error: OpenCV(4.5.5) error: (-215:Assertion failed) !_img.empty() in function 'cv::imwrite'
cv2.error: OpenCV(4.5.5) error: (-215:Assertion failed) !_img.empty() in function 'cv::imwrite'
PYTHON : error: (-215) !empty() in function detectMultiScale
PYTHON : error: (-215) !empty() in function detectMultiScale
error: (-215:Assertion failed) src.type() == CV_8UC1 in function 'cv::adaptiveThreshold'
error: (-215:Assertion failed) src.type() == CV_8UC1 in function 'cv::adaptiveThreshold'
error: (-215:Assertion failed) !ssize.empty() in function 'cv::resize' | cv2.error
error: (-215:Assertion failed) !ssize.empty() in function 'cv::resize' | cv2.error
(Solution)cv2.error: error: (-215:Assertion failed) !_src.empty() in function 'cv::cvtColor'
(Solution)cv2.error: error: (-215:Assertion failed) !_src.empty() in function 'cv::cvtColor'
(SOLVED) Error Assertion failed ! src empty in Function  cv: cvtColor | Python error | cv2 Module
(SOLVED) Error Assertion failed ! src empty in Function cv: cvtColor | Python error | cv2 Module
error:(-215:Assertion failed) size.width0 && size.height0 in function 'cv::imshow' SOLVED in opencv
error:(-215:Assertion failed) size.width0 && size.height0 in function 'cv::imshow' SOLVED in opencv
error: (-215:Assertion failed) size.width>0 && size.height>0 in function 'cv::imshow' |cv2.error
error: (-215:Assertion failed) size.width>0 && size.height>0 in function 'cv::imshow' |cv2.error
100% resolved imshow | (-215: Assertion Failed) size.width && size.height in function 'cv::imshow'
100% resolved imshow | (-215: Assertion Failed) size.width && size.height in function 'cv::imshow'
Video Capture function produces cv::cvtcolor error | OpenCv error resolved
Video Capture function produces cv::cvtcolor error | OpenCv error resolved
error: (-215:Assertion failed) size.width>0 && size.height>0 in function 'cv::imshow' |cv2.error
error: (-215:Assertion failed) size.width>0 && size.height>0 in function 'cv::imshow' |cv2.error

Expert Insights

Data is compiled from public records and verified media reports.

Last Updated: September 26, 2026

Future Outlook

Details cv2.error: error: (-215:Assertion failed) !_src.empty() in function 'cv::cvtColor' Guide
For 2026, Error 215 Assertion Failed Empty In Function Cv Cascadeclassifier Detectmultiscale remains one of the most searched-for information profiles. Check back for the latest updates.

Disclaimer: Disclaimer: All information is compiled from publicly available data, media reports, and analysis. Actual details may vary.

Summary

error215Assertionfailedssizeemptyinfunctioncvresize I am fresher youtuber Sorry for my mistakes. If you have any query here, I will reply you. Thank you.

Error 215 Assertion Failed Empty In Function Cv Cascadeclassifier Detectmultiscale.pdf

Size: 4.20 MB · Format: PDF · Secure Download

Download PDF Read Online

Frequently Asked Questions

What is the most accurate information about Error 215 Assertion Failed Empty In Function Cv Cascadeclassifier Detectmultiscale?

Our platform aggregates the most comprehensive and up-to-date insights, ensuring you get relevant details about Error 215 Assertion Failed Empty In Function Cv Cascadeclassifier Detectmultiscale.

Why is Error 215 Assertion Failed Empty In Function Cv Cascadeclassifier Detectmultiscale trending right now?

Interest in Error 215 Assertion Failed Empty In Function Cv Cascadeclassifier Detectmultiscale has surged recently as more people seek reliable resources, related media, and detailed analysis.

Where can I find related media and updates for Error 215 Assertion Failed Empty In Function Cv Cascadeclassifier Detectmultiscale?

You can explore extensive galleries, video summaries, and related content directly on this page.

How often is the content about Error 215 Assertion Failed Empty In Function Cv Cascadeclassifier Detectmultiscale updated?

We regularly update our database with the latest information, media, and analysis related to Error 215 Assertion Failed Empty In Function Cv Cascadeclassifier Detectmultiscale.

Related Documents

Popular Topics

Netbeans Hello World Java Application What Happened To Teachers Laid Off From Santa Ana Unified How To Submit A Magnet Or Year Round Application How To Connect To Sql Server From Python Using Sqlalchemy Mocking A Class Mock Or Patch How To Create A New Project On Github Quick Guide What Makes Built In Colorado A Magnet For Young Talent Httpsession Interface In Servlet How To Host A Virtual Trivia Night Exploring Section 8 Tenants Renting Pros And Cons Google Translator Using Python Googletrans Translator Python Micro Project Tech Blooded 15 Python Comparison Operators Histograms Histograms In Python Histograms In Matplotlib Histogram Matplotlib Python E Rate Basic Training For Funding Year 2014 Tree Trunk Template Inspirations For Home Decor And More