Execution Failed For Task App Checkdebugduplicateclasses Information Guide

  1. Overview of Execution Failed For Task App Checkdebugduplicateclasses
  2. Key Details
  3. History
  4. Full Guide
  5. Conclusion

Overview of Execution Failed For Task App Checkdebugduplicateclasses

Details How to Resolve the Flutter Execution failed for task ':app:checkDebugDuplicateClasses' Error Update
Looking for the latest information on Execution Failed For Task App Checkdebugduplicateclasses? We've researched comprehensive data, records, and insights about Execution Failed For Task App Checkdebugduplicateclasses.

Key Details

Full How to fix Execution failed for task ':app:compileDebugKotlin' | jvm target compatibility error. Guide
Explore the primary sources for Execution Failed For Task App Checkdebugduplicateclasses.

History

Information Error : Execution failed for task':app:checkDebugDuplicateClasses'.. News
Stay updated on Execution Failed For Task App Checkdebugduplicateclasses's latest milestones.

Execution failed for task ':app:checkDebugDuplicateClasses' (Android Studio) 2023
Execution failed for task ':app:checkDebugDuplicateClasses' (Android Studio) 2023
Fix for 'Execution failed for task :app:mapDebugSourceSetPaths' Error in Flutter & Firebase
Fix for 'Execution failed for task :app:mapDebugSourceSetPaths' Error in Flutter & Firebase
Execution failed for task ':app:compileDebugKotlin' in Android Studio || Flutter || ERROR SOLVED ✅
Execution failed for task ':app:compileDebugKotlin' in Android Studio || Flutter || ERROR SOLVED ✅
Execution failed for task ':app:checkDebugAarMetadata'. | Android Studio Error Fixed | Error Resolve
Execution failed for task ':app:checkDebugAarMetadata'. | Android Studio Error Fixed | Error Resolve
learn flutter, What went wrong: Execution failed for task ':app:checkDebugDuplicateClasses'.
learn flutter, What went wrong: Execution failed for task ':app:checkDebugDuplicateClasses'.
FAILURE: Build failed with an exception | Execution failed for task ':app:processDebugManifest' |
FAILURE: Build failed with an exception | Execution failed for task ':app:processDebugManifest' |
How to fix Execution failed for task ':app:compileDebugKotlin'  | عربي
How to fix Execution failed for task ':app:compileDebugKotlin' | عربي
Execution failed for task ':app:checkDebugDuplicateClasses'
Execution failed for task ':app:checkDebugDuplicateClasses'
Android : Execution failed for task ':app:checkDebugDuplicateClasses'. Ionic4 Android
Android : Execution failed for task ':app:checkDebugDuplicateClasses'. Ionic4 Android
How to fix Execution failed for task ':app:processDebugGoogleServices'. in Android Studio 2021
How to fix Execution failed for task ':app:processDebugGoogleServices'. in Android Studio 2021
[Solved] Error:Execution failed for task ':app:compileDebugAidl'. aidl is missing Android Studio
[Solved] Error:Execution failed for task ':app:compileDebugAidl'. aidl is missing Android Studio

Full Guide

Data is compiled from public records and verified media reports.

Last Updated: September 27, 2026

Conclusion

Information Fix Execution failed for task  app check Debug Duplicate Classes || Android Studio 2022 | Ict Foysal News
For 2026, Execution Failed For Task App Checkdebugduplicateclasses remains one of the most talked-about information profiles. Check back for the latest updates.

Disclaimer: Disclaimer: All information is compiled from publicly available data, media reports, and analysis. Actual details may vary.

Summary

Learn how to fix the common `Flutter Solution for Kotlin project compilation error " configurations{ all*.exclude group:'com.google.guava', module: 'listenablefuture' } In this tutorial, we'll tackle the common Android Studio build If This Video Helped You, Please My Channel Thank You For Watching. Android studio common error when we run new Android project on Updated version so here is Error: Execution failed for task ... learn flutter and android. FAILURE: Build failed with an exception. * What went wrong: You can find the latest Kotlin version: kotlinlang.org/docs/releases.html الله يسعدكم وصلوا على النبي واشتراك في القناة FAILURE: Build failed with an exception. * What went wrong:

Execution Failed For Task App Checkdebugduplicateclasses.pdf

Size: 2.97 MB · Format: PDF · Secure Download

Download PDF Read Online

Frequently Asked Questions

What is the most accurate information about Execution Failed For Task App Checkdebugduplicateclasses?

Our platform aggregates the most comprehensive and up-to-date insights, ensuring you get relevant details about Execution Failed For Task App Checkdebugduplicateclasses.

Why is Execution Failed For Task App Checkdebugduplicateclasses trending right now?

Interest in Execution Failed For Task App Checkdebugduplicateclasses has surged recently as more people seek reliable resources, related media, and detailed analysis.

Where can I find related media and updates for Execution Failed For Task App Checkdebugduplicateclasses?

You can explore extensive galleries, video summaries, and related content directly on this page.

How often is the content about Execution Failed For Task App Checkdebugduplicateclasses updated?

We regularly update our database with the latest information, media, and analysis related to Execution Failed For Task App Checkdebugduplicateclasses.

Related Documents

Popular Topics

Javascript Tutorial Password Form Validation In Javascript React Using Regex For Login Form Python Function Arguments Explained Default Keyword Positional With Real Life Examples Simple Keylogger In Python Tutorial 10 Mistakes Every Shih Tzu Owner Should Avoid Intro Synapps 2026 Electrical Computer Energy Engineering Graduation Ceremony Marbury V Madison Case Brief Summary Law Case Explained Python 3 Matplotlib Script To Create Data Visualization Charts From Csv File Export To Image Pdf Navigating Drexels Semester Based Curriculum With Ease How To Draw The Mexican Flag Request Subtle Shift Cause And Effect Crosscutting Concept Powershell Ps Tutorial How To Use Ps Cmdlet On Windows Output Hello World In Java How To Tutorial How To Create Custom Directive In Angular Hostlistener Elementref Angular 22 Tutorial Reducing Division Problems Like Fractions Shorts