Transformexception Failed To Transform React Native 0 71 0 Rc 0 Debug Aar Com Facebook React Native Information Guide

  1. About of Transformexception Failed To Transform React Native 0 71 0 Rc 0 Debug Aar Com Facebook React Native
  2. Main Features
  3. History
  4. Detailed Analysis
  5. Summary

About of Transformexception Failed To Transform React Native 0 71 0 Rc 0 Debug Aar Com Facebook React Native

Details TransformException Failed to transform react native 0 71 0 rc 0 debug aar com facebook react native Update
Looking for the latest information on Transformexception Failed To Transform React Native 0 71 0 Rc 0 Debug Aar Com Facebook React Native? We've gathered comprehensive data, records, and insights about Transformexception Failed To Transform React Native 0 71 0 Rc 0 Debug Aar Com Facebook React Native.

Main Features

Fix React Native Error: Failed to apply plugin ‘com.facebook.react.rootproject’ || Series 2026 News
Explore the main sources for Transformexception Failed To Transform React Native 0 71 0 Rc 0 Debug Aar Com Facebook React Native.

History

Information No matching variant of com.facebook.react:react-native:0.71.0-rc.0 was found React Native fixed News
Stay updated on Transformexception Failed To Transform React Native 0 71 0 Rc 0 Debug Aar Com Facebook React Native's latest milestones.

Task :react-native-reanimated: compileDebugJavaWithJavac FAILED by MD Israr
Task :react-native-reanimated: compileDebugJavaWithJavac FAILED by MD Israr
Error on Task apptransformDexArchiveWithExternalLibsDexMergerForDebug FAILED in react-native-maps
Error on Task apptransformDexArchiveWithExternalLibsDexMergerForDebug FAILED in react-native-maps
NodeJS : node.js Failed to construct transformer: Error: error:0308010C:digital envelope routines::u
NodeJS : node.js Failed to construct transformer: Error: error:0308010C:digital envelope routines::u
NodeJS : React native : Failed to construct transformer: Error: Cannot create a string longer than 0
NodeJS : React native : Failed to construct transformer: Error: Cannot create a string longer than 0
Task :app:transformNativeLibsWithMergeJniLibsForDebug FAILED in react native | android studio
Task :app:transformNativeLibsWithMergeJniLibsForDebug FAILED in react native | android studio
Fix Error Resolving Plugin [id: com.facebook.react.settings] in React Native CLI | Step-by-Step
Fix Error Resolving Plugin [id: com.facebook.react.settings] in React Native CLI | Step-by-Step
Fix Gradle Errors in React Native | Step-by-Step Guide
Fix Gradle Errors in React Native | Step-by-Step Guide
Fixing Gradle build failed Error in React Native with EAS Build for Android
Fixing Gradle build failed Error in React Native with EAS Build for Android
Null extracted folder for artifact Resolved ArtifactcomponentIdentifier react native build error
Null extracted folder for artifact Resolved ArtifactcomponentIdentifier react native build error
[Fixed] Gradle build failed with unknown error in Expo/React Native
[Fixed] Gradle build failed with unknown error in Expo/React Native
React Native Error: Component auth has not been registered yet SOLVED (Expo/Hermes)
React Native Error: Component auth has not been registered yet SOLVED (Expo/Hermes)

Detailed Analysis

Data is compiled from public records and verified media reports.

Last Updated: September 27, 2026

Summary

Details Error Resolving Plugin - id: 'com.facebook.react.settings | React Native CLI Gradle Build Failed News
For 2026, Transformexception Failed To Transform React Native 0 71 0 Rc 0 Debug Aar Com Facebook React Native remains one of the most talked-about information profiles. Check back for the latest updates.

Disclaimer: Disclaimer: All information is compiled from publicly available data, media reports, and analysis. Actual details may vary.

Summary

In this video,I explain How do i solve below Hello everyone Welcome back to the channel. In this video, we are going to fix one of the most common Problem: ------- No matching variant of com. I have explained to resolve the issue for "Task :app:transformNativeLibsWithMergeJniLibsForDebug Facing Gradle issues while working with Learn how to resolve the Gradle build Component auth has not been registered yet (or a similar component name)

Transformexception Failed To Transform React Native 0 71 0 Rc 0 Debug Aar Com Facebook React Native.pdf

Size: 1.19 MB · Format: PDF · Secure Download

Download PDF Read Online

Frequently Asked Questions

What is the most accurate information about Transformexception Failed To Transform React Native 0 71 0 Rc 0 Debug Aar Com Facebook React Native?

Our platform aggregates the most comprehensive and up-to-date insights, ensuring you get relevant details about Transformexception Failed To Transform React Native 0 71 0 Rc 0 Debug Aar Com Facebook React Native.

Why is Transformexception Failed To Transform React Native 0 71 0 Rc 0 Debug Aar Com Facebook React Native trending right now?

Interest in Transformexception Failed To Transform React Native 0 71 0 Rc 0 Debug Aar Com Facebook React Native has surged recently as more people seek reliable resources, related media, and detailed analysis.

Where can I find related media and updates for Transformexception Failed To Transform React Native 0 71 0 Rc 0 Debug Aar Com Facebook React Native?

You can explore extensive galleries, video summaries, and related content directly on this page.

How often is the content about Transformexception Failed To Transform React Native 0 71 0 Rc 0 Debug Aar Com Facebook React Native updated?

We regularly update our database with the latest information, media, and analysis related to Transformexception Failed To Transform React Native 0 71 0 Rc 0 Debug Aar Com Facebook React Native.

Related Documents

Popular Topics

What Are Steps To Implement Workforce Forecasts Ruler Fractions Templates For The Win Unlocking Math For Your Students Arithmetic Mean Vs Geometric Mean Improving Your Prompts And Adding Interactivity Magic Patterns Learn Javascript Math Class Most Important Functions Lofi Chilled Beats 12 Hours Of Dmca Free And Copyright Free Music For Twitch Streamers 2021 Top Unique Python Projects From Beginner To Intermediate Git Tutorial 31 How To Use Git Add To Stage Changes Learn Git Next Js Explained How To Run Python In Sublime Text 4 How To Create A Java Gui Programme Using Netbeans Ide Version 8 0 2 Lego Star Wars Republic Fighter Tank 7679 75182 75342 Comparison 4 0 Escape Sequences In Java I Wore Stilts For A Day Terrifying Cnn Image Classification Cifar Dataset Python